{"text_format":"1","workbook":"xlsx","n_sheets":5,"sheets":["comunidades","codigos","Simulación","datos_mapa","mapa"],"not_rendered":{"charts":0,"images":1,"macros":1,"external_links":0,"defined_names":3,"comments":1,"pivot_tables":0},"unopened":[],"bounds":{"document_bytes":16777216,"sheet_cells":100000,"rows_first":2000,"rows_last":500,"rows_between":2000,"halvings":0,"cell_chars":16384,"cell_head_chars":4096},"cells_cut":0,"cells_raw":0,"read":"whole","date_system":"1900"}

{"sheet":"comunidades","index":0,"n_rows":51,"n_cols":2,"rows_kept":51,"cut":false,"hidden":true,"merged":[]}
["Autonomia","Provincia"]
["Andalucía","Almería"]
["Andalucía","Cádiz"]
["Andalucía","Córdoba"]
["Andalucía","Granada"]
["Andalucía","Huelva"]
["Andalucía","Jaén"]
["Andalucía","Málaga"]
["Andalucía","Sevilla"]
["Aragón","Huesca"]
["Aragón","Teruel"]
["Aragón","Zaragoza"]
["Asturias","Asturias"]
["Cantabria","Cantabria"]
["Castilla y León","Ávila"]
["Castilla y León","Burgos"]
["Castilla y León","León"]
["Castilla y León","Palencia"]
["Castilla y León","Salamanca"]
["Castilla y León","Segovia"]
{"$rows_left_out":32}
{"sheet":"codigos","index":1,"n_rows":88,"n_cols":6,"rows_kept":88,"cut":false,"hidden":true,"merged":[[0,0,0,2],[0,4,0,5]]}
["PROVINCIAS",null,null,null,"ZONAS"]
["Código",null,"Provincia","DGT","zona","provin2"]
["01",1,"Alava","NORTE","01 ALAVA","Alava"]
["02",2,"Albacete","ESTE","02 ALBACETE","Albacete"]
["03",3,"Alicante","ESTE","03 ALICANTE","Alicante"]
["04",4,"Almeria","SUR","04 ALMERIA","Almeria"]
["05",5,"Avila","CENTRO","05 AVILA","Avila"]
["06",6,"Badajoz","SUROESTE","06 BADAJOZ","Badajoz"]
["07",7,"Baleares","MADRID-BALEARES","07 BALEARES","Baleares"]
["08",8,"Barcelona","CATALUÑA","08 BARCELONA","Barcelona"]
["09",9,"Burgos","CENTRO","09 BURGOS","Burgos"]
["10",10,"Caceres","SUROESTE","10 CACERES","Caceres"]
["11",11,"Cadiz","SUROESTE","101 MONDRAGON GUIPUZCOA","Vizcaya"]
["12",12,"Castellon","ESTE","102 MONDRAGON VIZCAYA","Vizcaya"]
["13",13,"Ciudad Real","CENTRO","104 ORDUÑA","Lugo"]
["14",14,"Cordoba","SUR","105 RIBADEO-VIVERO NUEVO 33","Lugo"]
["15",15,"La Coruña","NOROESTE","106 RIBADEO-VIVERO NUEVO 27","Lugo"]
["16",16,"Cuenca","ESTE","107 LANZAROTE","Gran Canaria"]
["17",17,"Gerona","CATALUÑA","108 LA PALMA","Gran Canaria"]
["18",18,"Granada","SUR","109 GOMERA","Gran Canaria"]
{"$rows_left_out":69}
{"sheet":"Simulación","index":2,"n_rows":58,"n_cols":28,"rows_kept":58,"cut":false,"hidden":true,"merged":[[1,2,1,13],[1,14,1,25]]}
[1,2,5,6,7,8,9,10,11,12,13,14,15,16,17,18,19,20,21,22,23,24,25,26,27,28]
[null,null,"SINCO mayores de 30 años",null,null,null,null,null,null,null,null,null,null,null,"Total de la nueva producción",null,null,null,null,null,null,null,null,null,null,null,null,"Octubre - Diciembre"]
[null,null,"Enero ","Febrero","Marzo","Abril","Mayo","Junio","Julio","Agosto","Septiembre","Octubre","Noviembre","Diciembre","Enero ","Febrero","Marzo","Abril","Mayo","Junio","Julio","Agosto","Septiembre","Octubre","Noviembre","Diciembre",null,"Mayores de 30 años "]
[]
["ALAVA",null,44520.130039731092,40117.857609535698,62433.840002058256,48649.915800528754,41320.14255358425,36858.209173474999,52025.063601747803,25224.863361735741,35689.697742106029,52484.387423836059,44882.964262362708,56351.170238420775,122155.53168420363,155879.69394230904,146332.96529513059,120476.28207015697,125823.85038268469,121861.03036993464,151140.29630425555,100024.09223013248,97445.98101913248,116738.97948922739,104910.31222324847,125681.17761937097,null,{"$f":"+L5+M5+N5","v":153718.52192461953}]
["ALBACETE",null,100545.3302744331,105241.63407890842,129389.36964114344,105297.38375560194,115624.39083349709,122066.78214579602,112564.00680591221,96456.675256704519,86426.37236319884,130175.99299351622,133377.26570589468,145833.1912301917,336081.76402994659,295119.1910397929,305473.35274169641,257848.76186039514,281652.78990452946,270881.59300668782,348559.23442600633,251238.73796104876,215570.25890762525,297434.91138261091,258146.93685916922,281275.28508274019,null,{"$f":"+L6+M6+N6","v":409386.44992960256}]
["ALICANTE",null,369865.33486368321,418439.92756306962,477762.79559265793,416612.73761282605,423891.53831357765,461573.22676648566,431598.82942851452,305500.31349560595,291286.78662177542,458642.79177134379,445508.58572707558,470048.58932744904,1547629.954946406,1299160.2751338743,2734974.820241516,1472730.172851112,1570514.1481591978,1593995.0621168786,1570259.1777179223,902300.35805447609,790921.18848002015,896662.60039164394,863050.81666534452,900299.32266666088,null,1374199.9668258685]
["ALMERIA",null,336963.53942094324,408020.57095547521,504620.32209149655,368854.30531675648,402936.32583999482,366731.04030591791,379984.23238289281,290380.09307567548,249054.23797333651,366237.96602421807,355739.55893958581,380701.21040596417,808781.18868762197,891559.23047824891,1079907.904131565,928366.85956519586,966258.58550013974,1018130.9375651608,949663.17582082073,790740.85795632075,689578.10241241904,852817.56398270256,785261.20256139489,788784.54814270104,null,1102678.735369768]
["AVILA",null,40596.744297072299,39427.453532098109,49740.395840795245,41293.166386524063,46006.184147194152,44682.178607845119,52619.255120754809,36944.495083536996,36476.712022000051,46471.239795038702,46788.377455699905,43294.257948335835,126833.62076605912,115447.05027399918,141884.99374215424,116378.16254526263,142726.95408900845,155450.47353821108,134294.55284881682,123781.37117978153,97477.96213877463,147617.51874856494,144978.623636498,135269.30827045455,null,136553.87519907445]
["BADAJOZ",null,176198.13573021433,196603.35069534279,280515.33321606112,218007.34363397164,217155.33674379109,191600.49347368779,234033.42359524962,184384.10562387397,145964.34719930292,235019.08992427171,226982.25037950056,266308.00627257529,596667.22287427925,572203.12986952055,957638.2912246479,557028.35635621613,625200.92839286115,702355.68548346974,687730.18145982095,575419.61109996331,470197.94359256054,601230.90962030482,590827.7314815874,616200.1991486873,null,728309.34657634748]
["BALEARES",null,149991.09474264414,197230.91624930769,225774.66334482288,197608.53116331281,192062.62887004387,242632.62307421316,243274.65010509029,146549.32745207491,131413.13606213502,172586.85785842317,155506.35675798921,151093.22207553432,746634.33931070031,854801.39887747134,2501350.2249519289,1264784.5977078001,1579135.2134525685,1166834.6115952497,1208379.8266726299,722030.24728450505,477697.95131346246,422319.24075736461,398094.37405938521,370068.70453603542,null,479186.4366919467]
["BARCELONA",null,1572406.7017817358,1543803.5176936563,2018644.3213288968,1610345.6610180428,1583913.6564580929,1684064.5627721401,1670472.4421451024,968923.1501670971,925832.43094156473,1240903.532475868,1125587.5989275738,1212999.0001146384,3799488.8645111308,4005547.3009301266,4307054.1386380484,3458014.2296906044,3687101.0695827748,3944129.0706003779,4250742.5008964194,2523241.0278177997,2387818.4111774685,2653549.670777746,2533808.0600346215,2559697.9480398502,null,3579490.1315180799]
["BURGOS",null,66909.624444515095,61183.638878674363,80524.625942661354,66648.629940771178,71926.457194323404,75005.171337240419,79852.228761738603,62229.312170945297,57657.307980718811,78179.890599888022,71069.63815900698,65499.799442545635,309443.93375022931,190408.96045483754,220876.80175925948,192154.30063634325,225891.44867023741,252500.0959730639,242672.632698209,171273.48960849541,137086.10877345363,160635.44216539286,145506.45135262125,151268.02089460159,null,214749.32820144063]
["CACERES",null,112707.88833640539,124748.74809983051,159344.68331239701,141239.20208125745,133096.8103023413,129705.66462825565,127000.30288010783,98636.240379545517,87038.321987692732,131194.80326348008,123702.62387786846,132925.55769197748,320076.96047902503,338162.00316640257,369832.51328888396,317490.00524380966,337484.76286166214,352902.43214231753,356809.77162166341,304294.48548464081,270533.18013534462,346546.98459009716,318914.94620005146,341942.41092894744,null,387822.98483332602]
["CADIZ",null,407785.44725115324,371133.76428504282,521926.33953646,471266.06785795366,446725.69651022175,498769.78581773955,465174.39157916553,429971.37565183773,339007.15804753487,468047.12967000244,484496.6795146495,484728.75396479684,1083530.7292569212,994057.86925455276,1191524.0462217897,1045081.9510885244,1141735.4197789375,1218032.3568783598,1144096.0573411528,1102180.0104156125,894483.68069932726,911761.72618643951,964072.01620185806,908291.59685135633,null,1437272.5631494487]
["CASTELLON",null,162765.10911504651,188003.68957025275,197811.8586225266,169266.9661252753,194100.17701653621,219453.95785590683,204382.24359141703,170390.45995265449,132516.5368992349,239411.85123929026,178868.77544354132,217862.67714736037,445938.3044451194,1137512.2412343055,2590691.3937568255,1029776.0115643069,1250295.1561479943,2336897.7130301585,961770.14072529692,453114.1733932643,416050.3989281953,538769.24778009043,424001.77852582716,458728.09304020344,null,636143.30383019196]
["CIUDAD REAL",null,130720.07558736575,127206.55474349423,169530.63942942829,136848.01831574965,144955.13985082216,154883.97358955187,159062.42814759121,126259.20844081318,114138.96064138811,167705.12938029057,159743.39727733293,170012.76893197364,372519.11605942517,347355.94386001991,433268.97739225044,338345.99221829773,359982.34153938782,403418.37908983225,431194.95070288947,354763.67544309195,283519.21450120618,371500.32018438791,391209.05178435659,387578.82241967478,null,497461.29558959708]
["CORDOBA",null,179310.87587015887,236225.31380778641,335726.56128679944,237402.68023688096,236508.87074849638,211640.18142563265,273497.17394444824,174144.3287998446,144392.11527184033,243476.76866055603,232547.04080144048,242274.73775959015,477783.43006547575,570383.23588385212,699827.92321134987,512497.01111830794,526518.99783560738,520933.93259181839,624880.4161920062,451597.98017396481,400852.10012413876,516547.66107564955,521792.0670904147,509488.24387710978,null,718298.54722158669]
["LA CORUÑA",null,245133.48152463124,275787.03632162412,362705.26775648387,241617.30679078246,247377.76410900103,305239.12881854136,269585.09893049335,232298.98648899415,196059.86215199163,288905.73779690306,292906.5600462149,331255.24698208773,734829.568626764,851187.08765349304,808278.23869527422,652846.28704462165,631863.5865369332,773889.90453722549,729243.14555941895,677983.08477926149,581887.99022408132,584634.86895591789,589615.49681863817,626979.09907756466,null,913067.5448252057]
["CUENCA",null,56216.707276603112,66400.75813729348,72801.034384974686,72765.986202657106,70309.41161591647,62256.046317947163,68676.088022966796,62414.530701289594,53781.609760127154,74111.549734727407,60250.680525431337,62814.824896289363,169072.6855198089,193418.64857379149,210902.28816957708,201595.85347724881,198691.41313531407,190479.63880569887,215889.30180447421,220762.25312503925,161097.29202557949,197186.88190141227,198257.04800160928,176411.74180272056,null,197177.0551564481]
{"$rows_left_out":39}
{"sheet":"datos_mapa","index":3,"n_rows":54,"n_cols":11,"rows_kept":54,"cut":false,"hidden":false,"merged":[[0,2,0,5],[0,7,0,10]]}
[null,null,"DATOS",null,null,null,null,"RANKING"]
["ID","PROVINCIA","Dato 1","Dato 2","Dato 3","Dato 4",null,{"$f":"C2","v":"Dato 1"},"Dato 2","Dato 3","Dato 4"]
["01","ALAVA",39,8.1556241982649325E-2,8.1556241982649325E-2,-0.91844375801735068,null,{"$f":"RANK(C3,C$3:C$54,0)","v":15},{"$f":"53 - RANK(D3,D$3:D$54,1)","v":42},{"$f":"RANK(E3,$E$3:$E$54,1)","v":11},{"$f":"RANK(F3,F$3:F$54,1)","v":1}]
["02","ALBACETE",45,2.4960477131076297E-3,2.4960477131076297E-3,-3.8699999999999998E-2,null,{"$f":"RANK(C4,C$3:C$54,0)","v":11},{"$f":"53 - RANK(D4,D$3:D$54,1)","v":52},{"$f":"RANK(E4,$E$3:$E$54,1)","v":1},{"$f":"RANK(F4,F$3:F$54,1)","v":27}]
["03","ALICANTE",21,0.3841644416768949,0.3841644416768949,6.3399999999999998E-2,null,36,29,24,42]
["04","ALMERIA",31,6.7956004754548993E-2,6.7956004754548993E-2,-7.4099999999999999E-2,null,29,43,10,13]
["33","ASTURIAS",48,0.56075286864655161,0.56075286864655161,3.3099999999999997E-2,null,4,23,30,39]
["05","AVILA",20,0.35199057233188003,0.35199057233188003,-3.1699999999999999E-2,null,37,30,23,28]
["06","BADAJOZ",7,5.1031840133325623E-2,5.1031840133325623E-2,-4.8000000000000001E-2,null,47,46,7,23]
["08","BARCELONA",48,0.90171479354359085,0.90171479354359085,8.2000000000000007E-3,null,4,5,48,34]
["09","BURGOS",2,0.83912525290939965,0.83912525290939965,9.4299999999999995E-2,null,52,9,44,47]
["10","CACERES",8,1.3004832658766174E-2,1.3004832658766174E-2,-9.4500000000000001E-2,null,46,51,2,10]
["11","CADIZ",34,0.89351898341427949,0.89351898341427949,-0.2198,null,24,7,46,4]
["39","CANTABRIA",28,0.69599023242950997,0.69599023242950997,-7.1499999999999994E-2,null,33,17,36,16]
["12","CASTELLON",48,0.24551580447323229,0.24551580447323229,1.54E-2,null,4,34,19,36]
["13","CIUDAD REAL",34,0.80705826085239374,0.80705826085239374,-5.4999999999999997E-3,null,24,11,42,32]
["14","CORDOBA",18,3.5336733548239962E-2,3.5336733548239962E-2,-7.4099999999999999E-2,null,40,49,4,13]
["15","LA CORUÑA",38,0.59685383916178525,0.59685383916178525,1.5100000000000001E-2,null,18,20,33,35]
["16","CUENCA",19,0.70980174062858659,0.70980174062858659,-0.108,null,38,16,37,6]
["17","GERONA",50,0.92901272581771521,0.92901272581771521,-5.21E-2,null,1,2,51,21]
{"$rows_left_out":35}
{"sheet":"mapa","index":4,"n_rows":55,"n_cols":23,"rows_kept":55,"cut":false,"hidden":false,"merged":[[26,25,27,26],[3,23,4,24],[3,25,4,26],[13,23,14,24],[13,25,14,26],[16,23,17,24],[16,25,17,26],[3,20,4,20],[13,20,14,20],[16,20,17,20],[26,20,27,20],[26,23,27,24]]}
[]
[null,null,null,null,null,null,null,null,null,null,null,null,null,null,null,null,"COLORES"]
[null,null,null,null,null,null,null,null,null,"Provincia","Shape",{"$f":"+datos_mapa!C2","v":"Dato 1"},{"$f":"+datos_mapa!D2","v":"Dato 2"},{"$f":"+datos_mapa!E2","v":"Dato 3"},{"$f":"+datos_mapa!F2","v":"Dato 4"},null,{"$f":"+datos_mapa!H2","v":"Dato 1"},{"$f":"+datos_mapa!I2","v":"Dato 2"},{"$f":"+datos_mapa!J2","v":"Dato 3"},{"$f":"+datos_mapa!K2","v":"Dato 4"},null,"Número ranking","color"]
[null,null,null,null,null,null,null,null,null,"Álava","alava",{"$f":"+datos_mapa!C3","v":39},{"$f":"TEXT(datos_mapa!D3,\"0,0%\")","v":"8,2%"},{"$f":"TEXT(datos_mapa!E3,\"0,0%\")","v":"8,2%"},{"$f":"TEXT(datos_mapa!F3,\"0,0%\")","v":"-91,8%"},null,{"$f":"VLOOKUP(datos_mapa!H3,mapa!$V$4:$W$55,2,0)","v":8378040},{"$f":"+VLOOKUP(datos_mapa!I3,mapa!$V$4:$W$55,2,0)","v":7707899},{"$f":"VLOOKUP(datos_mapa!J3,mapa!$V$4:$W$55,2,0)","v":8310688},{"$f":"VLOOKUP(datos_mapa!K3,mapa!$V$4:$W$55,2,0)","v":8109667},null,1,8109667]
[null,null,null,null,null,null,null,null,null,"Albacete","albacete",{"$f":"+datos_mapa!C4","v":45},{"$f":"TEXT(datos_mapa!D4,\"0,0%\")","v":"0,2%"},{"$f":"TEXT(datos_mapa!E4,\"0,0%\")","v":"0,2%"},{"$f":"TEXT(datos_mapa!F4,\"0,0%\")","v":"-3,9%"},null,{"$f":"VLOOKUP(datos_mapa!H4,mapa!$V$4:$W$55,2,0)","v":8310688},{"$f":"+VLOOKUP(datos_mapa!I4,mapa!$V$4:$W$55,2,0)","v":7039480},{"$f":"VLOOKUP(datos_mapa!J4,mapa!$V$4:$W$55,2,0)","v":8109667},{"$f":"VLOOKUP(datos_mapa!K4,mapa!$V$4:$W$55,2,0)","v":8710655},null,2,8109929]
[null,null,null,null,null,null,null,null,null,"Alicante","alicante",{"$f":"+datos_mapa!C5","v":21},{"$f":"TEXT(datos_mapa!D5,\"0,0%\")","v":"38,4%"},{"$f":"TEXT(datos_mapa!E5,\"0,0%\")","v":"38,4%"},{"$f":"TEXT(datos_mapa!F5,\"0,0%\")","v":"6,3%"},null,{"$f":"VLOOKUP(datos_mapa!H5,mapa!$V$4:$W$55,2,0)","v":8109053},{"$f":"+VLOOKUP(datos_mapa!I5,mapa!$V$4:$W$55,2,0)","v":8577023},{"$f":"VLOOKUP(datos_mapa!J5,mapa!$V$4:$W$55,2,0)","v":8644335},{"$f":"VLOOKUP(datos_mapa!K5,mapa!$V$4:$W$55,2,0)","v":7707899},null,3,8110447]
[null,null,null,null,null,null,null,null,null,"Almería","almeria",{"$f":"+datos_mapa!C6","v":31},{"$f":"TEXT(datos_mapa!D6,\"0,0%\")","v":"6,8%"},{"$f":"TEXT(datos_mapa!E6,\"0,0%\")","v":"6,8%"},{"$f":"TEXT(datos_mapa!F6,\"0,0%\")","v":"-7,4%"},null,{"$f":"VLOOKUP(datos_mapa!H6,mapa!$V$4:$W$55,2,0)","v":8577023},{"$f":"+VLOOKUP(datos_mapa!I6,mapa!$V$4:$W$55,2,0)","v":7641083},{"$f":"VLOOKUP(datos_mapa!J6,mapa!$V$4:$W$55,2,0)","v":8310170},{"$f":"VLOOKUP(datos_mapa!K6,mapa!$V$4:$W$55,2,0)","v":8377260},null,4,8176501]
[null,null,null,null,null,null,null,null,null,"Asturias","asturias",{"$f":"+datos_mapa!C7","v":48},{"$f":"TEXT(datos_mapa!D7,\"0,0%\")","v":"56,1%"},{"$f":"TEXT(datos_mapa!E7,\"0,0%\")","v":"56,1%"},{"$f":"TEXT(datos_mapa!F7,\"0,0%\")","v":"3,3%"},null,{"$f":"VLOOKUP(datos_mapa!H7,mapa!$V$4:$W$55,2,0)","v":8176501},{"$f":"+VLOOKUP(datos_mapa!I7,mapa!$V$4:$W$55,2,0)","v":8578281},{"$f":"VLOOKUP(datos_mapa!J7,mapa!$V$4:$W$55,2,0)","v":8510207},{"$f":"VLOOKUP(datos_mapa!K7,mapa!$V$4:$W$55,2,0)","v":7908604},null,5,8177019]
[null,null,null,null,null,null,null,null,null,"Ávila","avila",{"$f":"+datos_mapa!C8","v":20},{"$f":"TEXT(datos_mapa!D8,\"0,0%\")","v":"35,2%"},{"$f":"TEXT(datos_mapa!E8,\"0,0%\")","v":"35,2%"},{"$f":"TEXT(datos_mapa!F8,\"0,0%\")","v":"-3,2%"},null,{"$f":"VLOOKUP(datos_mapa!H8,mapa!$V$4:$W$55,2,0)","v":8042237},{"$f":"+VLOOKUP(datos_mapa!I8,mapa!$V$4:$W$55,2,0)","v":8510207},{"$f":"VLOOKUP(datos_mapa!J8,mapa!$V$4:$W$55,2,0)","v":8578281},{"$f":"VLOOKUP(datos_mapa!K8,mapa!$V$4:$W$55,2,0)","v":8643839},null,6,8177281]
[null,null,null,null,null,null,null,null,null,"Badajoz","badajoz",{"$f":"+datos_mapa!C9","v":7},{"$f":"TEXT(datos_mapa!D9,\"0,0%\")","v":"5,1%"},{"$f":"TEXT(datos_mapa!E9,\"0,0%\")","v":"5,1%"},{"$f":"TEXT(datos_mapa!F9,\"0,0%\")","v":"-4,8%"},null,{"$f":"VLOOKUP(datos_mapa!H9,mapa!$V$4:$W$55,2,0)","v":7373818},{"$f":"+VLOOKUP(datos_mapa!I9,mapa!$V$4:$W$55,2,0)","v":7440634},{"$f":"VLOOKUP(datos_mapa!J9,mapa!$V$4:$W$55,2,0)","v":8243335},{"$f":"VLOOKUP(datos_mapa!K9,mapa!$V$4:$W$55,2,0)","v":8578281},null,7,8243335]
[null,null,null,null,null,null,null,null,null,"Barcelona","barcelona",{"$f":"+datos_mapa!C10","v":48},{"$f":"TEXT(datos_mapa!D10,\"0,0%\")","v":"90,2%"},{"$f":"TEXT(datos_mapa!E10,\"0,0%\")","v":"90,2%"},{"$f":"TEXT(datos_mapa!F10,\"0,0%\")","v":"0,8%"},null,{"$f":"VLOOKUP(datos_mapa!H10,mapa!$V$4:$W$55,2,0)","v":8176501},{"$f":"+VLOOKUP(datos_mapa!I10,mapa!$V$4:$W$55,2,0)","v":8177019},{"$f":"VLOOKUP(datos_mapa!J10,mapa!$V$4:$W$55,2,0)","v":7307002},{"$f":"VLOOKUP(datos_mapa!K10,mapa!$V$4:$W$55,2,0)","v":8242685},null,8,8243853]
[null,null,null,null,null,null,null,null,null,"Burgos","burgos",{"$f":"+datos_mapa!C11","v":2},{"$f":"TEXT(datos_mapa!D11,\"0,0%\")","v":"83,9%"},{"$f":"TEXT(datos_mapa!E11,\"0,0%\")","v":"83,9%"},{"$f":"TEXT(datos_mapa!F11,\"0,0%\")","v":"9,4%"},null,{"$f":"VLOOKUP(datos_mapa!H11,mapa!$V$4:$W$55,2,0)","v":7039480},{"$f":"+VLOOKUP(datos_mapa!I11,mapa!$V$4:$W$55,2,0)","v":8244371},{"$f":"VLOOKUP(datos_mapa!J11,mapa!$V$4:$W$55,2,0)","v":7574267},{"$f":"VLOOKUP(datos_mapa!K11,mapa!$V$4:$W$55,2,0)","v":7373818},null,9,8244371]
[null,null,null,null,null,null,null,null,null,"Cáceres","caceres",{"$f":"+datos_mapa!C12","v":8},{"$f":"TEXT(datos_mapa!D12,\"0,0%\")","v":"1,3%"},{"$f":"TEXT(datos_mapa!E12,\"0,0%\")","v":"1,3%"},{"$f":"TEXT(datos_mapa!F12,\"0,0%\")","v":"-9,5%"},null,{"$f":"VLOOKUP(datos_mapa!H12,mapa!$V$4:$W$55,2,0)","v":7440634},{"$f":"+VLOOKUP(datos_mapa!I12,mapa!$V$4:$W$55,2,0)","v":7106553},{"$f":"VLOOKUP(datos_mapa!J12,mapa!$V$4:$W$55,2,0)","v":8109929},{"$f":"VLOOKUP(datos_mapa!K12,mapa!$V$4:$W$55,2,0)","v":8310170},null,10,8310170]
[null,null,null,null,null,null,null,null,null,"Cádiz","cadiz",{"$f":"+datos_mapa!C13","v":34},{"$f":"TEXT(datos_mapa!D13,\"0,0%\")","v":"89,4%"},{"$f":"TEXT(datos_mapa!E13,\"0,0%\")","v":"89,4%"},{"$f":"TEXT(datos_mapa!F13,\"0,0%\")","v":"-22,0%"},null,{"$f":"VLOOKUP(datos_mapa!H13,mapa!$V$4:$W$55,2,0)","v":8644335},{"$f":"+VLOOKUP(datos_mapa!I13,mapa!$V$4:$W$55,2,0)","v":8243335},{"$f":"VLOOKUP(datos_mapa!J13,mapa!$V$4:$W$55,2,0)","v":7440634},{"$f":"VLOOKUP(datos_mapa!K13,mapa!$V$4:$W$55,2,0)","v":8176501},null,11,8310688]
[null,null,null,null,null,null,null,null," ","Cantabria","cantabria",{"$f":"+datos_mapa!C14","v":28},{"$f":"TEXT(datos_mapa!D14,\"0,0%\")","v":"69,6%"},{"$f":"TEXT(datos_mapa!E14,\"0,0%\")","v":"69,6%"},{"$f":"TEXT(datos_mapa!F14,\"0,0%\")","v":"-7,2%"},null,{"$f":"VLOOKUP(datos_mapa!H14,mapa!$V$4:$W$55,2,0)","v":8309502},{"$f":"+VLOOKUP(datos_mapa!I14,mapa!$V$4:$W$55,2,0)","v":8444612},{"$f":"VLOOKUP(datos_mapa!J14,mapa!$V$4:$W$55,2,0)","v":8109053},{"$f":"VLOOKUP(datos_mapa!K14,mapa!$V$4:$W$55,2,0)","v":8444094},null,12,8311206]
[null,null,null,null,null,null,null,null,null,"Castellón","castellon",{"$f":"+datos_mapa!C15","v":48},{"$f":"TEXT(datos_mapa!D15,\"0,0%\")","v":"24,6%"},{"$f":"TEXT(datos_mapa!E15,\"0,0%\")","v":"24,6%"},{"$f":"TEXT(datos_mapa!F15,\"0,0%\")","v":"1,5%"},null,{"$f":"VLOOKUP(datos_mapa!H15,mapa!$V$4:$W$55,2,0)","v":8176501},{"$f":"+VLOOKUP(datos_mapa!I15,mapa!$V$4:$W$55,2,0)","v":8242685},{"$f":"VLOOKUP(datos_mapa!J15,mapa!$V$4:$W$55,2,0)","v":8510929},{"$f":"VLOOKUP(datos_mapa!K15,mapa!$V$4:$W$55,2,0)","v":8109053},null,13,8377260]
[null,null,null,null,null,null,null,null,null,"Ciudad Real","c_real",{"$f":"+datos_mapa!C16","v":34},{"$f":"TEXT(datos_mapa!D16,\"0,0%\")","v":"80,7%"},{"$f":"TEXT(datos_mapa!E16,\"0,0%\")","v":"80,7%"},{"$f":"TEXT(datos_mapa!F16,\"0,0%\")","v":"-0,6%"},null,{"$f":"VLOOKUP(datos_mapa!H16,mapa!$V$4:$W$55,2,0)","v":8644335},{"$f":"+VLOOKUP(datos_mapa!I16,mapa!$V$4:$W$55,2,0)","v":8310688},{"$f":"VLOOKUP(datos_mapa!J16,mapa!$V$4:$W$55,2,0)","v":7707899},{"$f":"VLOOKUP(datos_mapa!K16,mapa!$V$4:$W$55,2,0)","v":8376318},null,14,8377522]
[null,null,null,null,null,null,null,null,null,"Córdoba","cordoba",{"$f":"+datos_mapa!C17","v":18},{"$f":"TEXT(datos_mapa!D17,\"0,0%\")","v":"3,5%"},{"$f":"TEXT(datos_mapa!E17,\"0,0%\")","v":"3,5%"},{"$f":"TEXT(datos_mapa!F17,\"0,0%\")","v":"-7,4%"},null,{"$f":"VLOOKUP(datos_mapa!H17,mapa!$V$4:$W$55,2,0)","v":7841788},{"$f":"+VLOOKUP(datos_mapa!I17,mapa!$V$4:$W$55,2,0)","v":7240185},{"$f":"VLOOKUP(datos_mapa!J17,mapa!$V$4:$W$55,2,0)","v":8176501},{"$f":"VLOOKUP(datos_mapa!K17,mapa!$V$4:$W$55,2,0)","v":8377260},null,15,8378040]
[null,null,null,null,null,null,null,null,null,"La Coruña","la_coruna",{"$f":"+datos_mapa!C18","v":38},{"$f":"TEXT(datos_mapa!D18,\"0,0%\")","v":"59,7%"},{"$f":"TEXT(datos_mapa!E18,\"0,0%\")","v":"59,7%"},{"$f":"TEXT(datos_mapa!F18,\"0,0%\")","v":"1,5%"},null,{"$f":"VLOOKUP(datos_mapa!H18,mapa!$V$4:$W$55,2,0)","v":8510667},{"$f":"+VLOOKUP(datos_mapa!I18,mapa!$V$4:$W$55,2,0)","v":8511447},{"$f":"VLOOKUP(datos_mapa!J18,mapa!$V$4:$W$55,2,0)","v":8309502},{"$f":"VLOOKUP(datos_mapa!K18,mapa!$V$4:$W$55,2,0)","v":8175869},null,16,8444094]
[null,null,null,null,null,null,null,null,null,"Cuenca","cuenca",{"$f":"+datos_mapa!C19","v":19},{"$f":"TEXT(datos_mapa!D19,\"0,0%\")","v":"71,0%"},{"$f":"TEXT(datos_mapa!E19,\"0,0%\")","v":"71,0%"},{"$f":"TEXT(datos_mapa!F19,\"0,0%\")","v":"-10,8%"},null,{"$f":"VLOOKUP(datos_mapa!H19,mapa!$V$4:$W$55,2,0)","v":7975420},{"$f":"+VLOOKUP(datos_mapa!I19,mapa!$V$4:$W$55,2,0)","v":8444094},{"$f":"VLOOKUP(datos_mapa!J19,mapa!$V$4:$W$55,2,0)","v":8042237},{"$f":"VLOOKUP(datos_mapa!K19,mapa!$V$4:$W$55,2,0)","v":8177281},null,17,8444612]
{"$rows_left_out":35}